{"text_format":"1","workbook":"xlsx","n_sheets":9,"sheets":["CW-berekening","Output","VAV-uitgebreid","Sterftetabel Man","Sterftetabel Vrouw","Blad2","Blad3","Blad1","Blad4"],"not_rendered":{"charts":0,"images":8,"macros":1,"external_links":1,"defined_names":4,"comments":0,"pivot_tables":0},"unopened":[],"bounds":{"document_bytes":16777216,"sheet_cells":100000,"rows_first":2000,"rows_last":500,"rows_between":2000,"halvings":0,"cell_chars":16384,"cell_head_chars":4096},"cells_cut":0,"cells_raw":0,"read":"whole","date_system":"1900"}

{"sheet":"CW-berekening","index":0,"n_rows":31,"n_cols":6,"rows_kept":31,"cut":false,"hidden":false,"merged":[[21,4,21,5]]}
[]
[]
[null,null,"Contante waarde berekening"]
[]
[null,null,"Dossiernr."]
[null,null,"Geboortedatum"]
[null,null,"Geslacht"]
[]
[null,null,"Startjaar*",null,"Startdatum",{"$f":"DATE(D9,1,1)","v":"1900-01-01"}]
[null,null,"Kapitalisatiejaar*"]
[]
[null,null,"Jaarlijkse schade"]
[null,null,"Duur schade*",null,"Einddatum",{"$f":"DATE(D9+D13,1,1)","v":"1900-01-01"}]
[]
[]
[null,null,"Rendement"]
[]
[]
[null,null,"Inflatie"]
[]
{"$rows_left_out":12}
{"sheet":"Output","index":1,"n_rows":97,"n_cols":19,"rows_kept":97,"cut":false,"hidden":false,"merged":[]}
[]
[null,"Contante waarde"]
[null,null,null,null,null,null,null,null,"Dossiernr.",null,{"$f":"'CW-berekening'!D5","v":0}]
[]
[]
[null,"Dossiernr.",{"$f":"'CW-berekening'!D5","v":0},null,null,null,null,null,"Jaar","Jaarschade","Sterftekans","Rendement","Inflatie","Contante waarde schade","Vermogen \nbegin","Vermogen \neinde","Opname schade","Fiscale schade","Rendement"]
[null,null,null,null,null,null,null,null,{"$f":"IFERROR(YEAR('VAV-uitgebreid'!B33),\"\")","v":""},{"$f":"'VAV-uitgebreid'!G33","v":" "},{"$f":"IF(I7=\"\",\"\",IF($C$29=\"ja\",'VAV-uitgebreid'!M33,1))","v":""},{"$f":"IF(I7=\"\", \"\",'VAV-uitgebreid'!Q33)","v":""},{"$f":"IF(I7=\"\", \"\",'VAV-uitgebreid'!N33)","v":""},{"$f":"IF($C$29=\"ja\",'VAV-uitgebreid'!AA33,'VAV-uitgebreid'!AB33)","v":" "},{"$f":"IF('VAV-uitgebreid'!AD33=0,\"\", 'VAV-uitgebreid'!AD33)","v":" "},{"$f":"'VAV-uitgebreid'!AG33","v":" "},{"$f":"IF('VAV-uitgebreid'!AE33=0,\"\",'VAV-uitgebreid'!AE33)","v":""},{"$f":"'VAV-uitgebreid'!BD33","v":" "},{"$f":"'VAV-uitgebreid'!AF33","v":" "}]
[null,null,null,null,null,null,null,null,{"$f":"IFERROR(YEAR('VAV-uitgebreid'!B34),\"\")","v":""},{"$f":"'VAV-uitgebreid'!G34","v":" "},{"$f":"IF(I8=\"\",\"\",IF($C$29=\"ja\",'VAV-uitgebreid'!M34,1))","v":""},{"$f":"IF(I8=\"\", \"\",'VAV-uitgebreid'!Q34)","v":""},{"$f":"IF(I8=\"\", \"\",'VAV-uitgebreid'!N34)","v":""},{"$f":"IF($C$29=\"ja\",'VAV-uitgebreid'!AA34,'VAV-uitgebreid'!AB34)","v":" "},{"$f":"IF('VAV-uitgebreid'!AD34=0,\"\", 'VAV-uitgebreid'!AD34)","v":" "},{"$f":"'VAV-uitgebreid'!AG34","v":" "},{"$f":"IF('VAV-uitgebreid'!AE34=0,\"\",'VAV-uitgebreid'!AE34)","v":""},{"$f":"'VAV-uitgebreid'!BD34","v":" "},{"$f":"'VAV-uitgebreid'!AF34","v":" "}]
[null,null,null,null,null,null,null,null,{"$f":"IFERROR(YEAR('VAV-uitgebreid'!B35),\"\")","v":""},{"$f":"'VAV-uitgebreid'!G35","v":" "},{"$f":"IF(I9=\"\",\"\",IF($C$29=\"ja\",'VAV-uitgebreid'!M35,1))","v":""},{"$f":"IF(I9=\"\", \"\",'VAV-uitgebreid'!Q35)","v":""},{"$f":"IF(I9=\"\", \"\",'VAV-uitgebreid'!N35)","v":""},{"$f":"IF($C$29=\"ja\",'VAV-uitgebreid'!AA35,'VAV-uitgebreid'!AB35)","v":" "},{"$f":"IF('VAV-uitgebreid'!AD35=0,\"\", 'VAV-uitgebreid'!AD35)","v":" "},{"$f":"'VAV-uitgebreid'!AG35","v":" "},{"$f":"IF('VAV-uitgebreid'!AE35=0,\"\",'VAV-uitgebreid'!AE35)","v":""},{"$f":"'VAV-uitgebreid'!BD35","v":" "},{"$f":"'VAV-uitgebreid'!AF35","v":" "}]
[null,null,null,null,null,null,null,null,{"$f":"IFERROR(YEAR('VAV-uitgebreid'!B36),\"\")","v":""},{"$f":"'VAV-uitgebreid'!G36","v":" "},{"$f":"IF(I10=\"\",\"\",IF($C$29=\"ja\",'VAV-uitgebreid'!M36,1))","v":""},{"$f":"IF(I10=\"\", \"\",'VAV-uitgebreid'!Q36)","v":""},{"$f":"IF(I10=\"\", \"\",'VAV-uitgebreid'!N36)","v":""},{"$f":"IF($C$29=\"ja\",'VAV-uitgebreid'!AA36,'VAV-uitgebreid'!AB36)","v":" "},{"$f":"IF('VAV-uitgebreid'!AD36=0,\"\", 'VAV-uitgebreid'!AD36)","v":" "},{"$f":"'VAV-uitgebreid'!AG36","v":" "},{"$f":"IF('VAV-uitgebreid'!AE36=0,\"\",'VAV-uitgebreid'!AE36)","v":""},{"$f":"'VAV-uitgebreid'!BD36","v":" "},{"$f":"'VAV-uitgebreid'!AF36","v":" "}]
[null,null,null,null,null,null,null,null,{"$f":"IFERROR(YEAR('VAV-uitgebreid'!B37),\"\")","v":""},{"$f":"'VAV-uitgebreid'!G37","v":" "},{"$f":"IF(I11=\"\",\"\",IF($C$29=\"ja\",'VAV-uitgebreid'!M37,1))","v":""},{"$f":"IF(I11=\"\", \"\",'VAV-uitgebreid'!Q37)","v":""},{"$f":"IF(I11=\"\", \"\",'VAV-uitgebreid'!N37)","v":""},{"$f":"IF($C$29=\"ja\",'VAV-uitgebreid'!AA37,'VAV-uitgebreid'!AB37)","v":" "},{"$f":"IF('VAV-uitgebreid'!AD37=0,\"\", 'VAV-uitgebreid'!AD37)","v":" "},{"$f":"'VAV-uitgebreid'!AG37","v":" "},{"$f":"IF('VAV-uitgebreid'!AE37=0,\"\",'VAV-uitgebreid'!AE37)","v":""},{"$f":"'VAV-uitgebreid'!BD37","v":" "},{"$f":"'VAV-uitgebreid'!AF37","v":" "}]
[null,null,null,null,null,null,null,null,{"$f":"IFERROR(YEAR('VAV-uitgebreid'!B38),\"\")","v":""},{"$f":"'VAV-uitgebreid'!G38","v":" "},{"$f":"IF(I12=\"\",\"\",IF($C$29=\"ja\",'VAV-uitgebreid'!M38,1))","v":""},{"$f":"IF(I12=\"\", \"\",'VAV-uitgebreid'!Q38)","v":""},{"$f":"IF(I12=\"\", \"\",'VAV-uitgebreid'!N38)","v":""},{"$f":"IF($C$29=\"ja\",'VAV-uitgebreid'!AA38,'VAV-uitgebreid'!AB38)","v":" "},{"$f":"IF('VAV-uitgebreid'!AD38=0,\"\", 'VAV-uitgebreid'!AD38)","v":" "},{"$f":"'VAV-uitgebreid'!AG38","v":" "},{"$f":"IF('VAV-uitgebreid'!AE38=0,\"\",'VAV-uitgebreid'!AE38)","v":""},{"$f":"'VAV-uitgebreid'!BD38","v":" "},{"$f":"'VAV-uitgebreid'!AF38","v":" "}]
[null,"Uitgangspunten",null,null,null,null,null,null,{"$f":"IFERROR(YEAR('VAV-uitgebreid'!B39),\"\")","v":""},{"$f":"'VAV-uitgebreid'!G39","v":" "},{"$f":"IF(I13=\"\",\"\",IF($C$29=\"ja\",'VAV-uitgebreid'!M39,1))","v":""},{"$f":"IF(I13=\"\", \"\",'VAV-uitgebreid'!Q39)","v":""},{"$f":"IF(I13=\"\", \"\",'VAV-uitgebreid'!N39)","v":""},{"$f":"IF($C$29=\"ja\",'VAV-uitgebreid'!AA39,'VAV-uitgebreid'!AB39)","v":" "},{"$f":"IF('VAV-uitgebreid'!AD39=0,\"\", 'VAV-uitgebreid'!AD39)","v":" "},{"$f":"'VAV-uitgebreid'!AG39","v":" "},{"$f":"IF('VAV-uitgebreid'!AE39=0,\"\",'VAV-uitgebreid'!AE39)","v":""},{"$f":"'VAV-uitgebreid'!BD39","v":" "},{"$f":"'VAV-uitgebreid'!AF39","v":" "}]
[null,"Geboortedatum",{"$f":"'CW-berekening'!D6","v":"00:00:00"},null,null,null,null,null,{"$f":"IFERROR(YEAR('VAV-uitgebreid'!B40),\"\")","v":""},{"$f":"'VAV-uitgebreid'!G40","v":" "},{"$f":"IF(I14=\"\",\"\",IF($C$29=\"ja\",'VAV-uitgebreid'!M40,1))","v":""},{"$f":"IF(I14=\"\", \"\",'VAV-uitgebreid'!Q40)","v":""},{"$f":"IF(I14=\"\", \"\",'VAV-uitgebreid'!N40)","v":""},{"$f":"IF($C$29=\"ja\",'VAV-uitgebreid'!AA40,'VAV-uitgebreid'!AB40)","v":" "},{"$f":"IF('VAV-uitgebreid'!AD40=0,\"\", 'VAV-uitgebreid'!AD40)","v":" "},{"$f":"'VAV-uitgebreid'!AG40","v":" "},{"$f":"IF('VAV-uitgebreid'!AE40=0,\"\",'VAV-uitgebreid'!AE40)","v":""},{"$f":"'VAV-uitgebreid'!BD40","v":" "},{"$f":"'VAV-uitgebreid'!AF40","v":" "}]
[null,"Geslacht",{"$f":"'CW-berekening'!D7","v":0},null,null,null,null,null,{"$f":"IFERROR(YEAR('VAV-uitgebreid'!B41),\"\")","v":""},{"$f":"'VAV-uitgebreid'!G41","v":" "},{"$f":"IF(I15=\"\",\"\",IF($C$29=\"ja\",'VAV-uitgebreid'!M41,1))","v":""},{"$f":"IF(I15=\"\", \"\",'VAV-uitgebreid'!Q41)","v":""},{"$f":"IF(I15=\"\", \"\",'VAV-uitgebreid'!N41)","v":""},{"$f":"IF($C$29=\"ja\",'VAV-uitgebreid'!AA41,'VAV-uitgebreid'!AB41)","v":" "},{"$f":"IF('VAV-uitgebreid'!AD41=0,\"\", 'VAV-uitgebreid'!AD41)","v":" "},{"$f":"'VAV-uitgebreid'!AG41","v":" "},{"$f":"IF('VAV-uitgebreid'!AE41=0,\"\",'VAV-uitgebreid'!AE41)","v":""},{"$f":"'VAV-uitgebreid'!BD41","v":" "},{"$f":"'VAV-uitgebreid'!AF41","v":" "}]
[null,null,null,null,null,null,null,null,{"$f":"IFERROR(YEAR('VAV-uitgebreid'!B42),\"\")","v":""},{"$f":"'VAV-uitgebreid'!G42","v":" "},{"$f":"IF(I16=\"\",\"\",IF($C$29=\"ja\",'VAV-uitgebreid'!M42,1))","v":""},{"$f":"IF(I16=\"\", \"\",'VAV-uitgebreid'!Q42)","v":""},{"$f":"IF(I16=\"\", \"\",'VAV-uitgebreid'!N42)","v":""},{"$f":"IF($C$29=\"ja\",'VAV-uitgebreid'!AA42,'VAV-uitgebreid'!AB42)","v":" "},{"$f":"IF('VAV-uitgebreid'!AD42=0,\"\", 'VAV-uitgebreid'!AD42)","v":""},{"$f":"'VAV-uitgebreid'!AG42","v":" "},{"$f":"IF('VAV-uitgebreid'!AE42=0,\"\",'VAV-uitgebreid'!AE42)","v":""},{"$f":"'VAV-uitgebreid'!BD42","v":" "},{"$f":"'VAV-uitgebreid'!AF42","v":" "}]
[null,"Jaarschade",null,null,null,null,null,null,{"$f":"IFERROR(YEAR('VAV-uitgebreid'!B43),\"\")","v":""},{"$f":"'VAV-uitgebreid'!G43","v":" "},{"$f":"IF(I17=\"\",\"\",IF($C$29=\"ja\",'VAV-uitgebreid'!M43,1))","v":""},{"$f":"IF(I17=\"\", \"\",'VAV-uitgebreid'!Q43)","v":""},{"$f":"IF(I17=\"\", \"\",'VAV-uitgebreid'!N43)","v":""},{"$f":"IF($C$29=\"ja\",'VAV-uitgebreid'!AA43,'VAV-uitgebreid'!AB43)","v":" "},{"$f":"IF('VAV-uitgebreid'!AD43=0,\"\", 'VAV-uitgebreid'!AD43)","v":""},{"$f":"'VAV-uitgebreid'!AG43","v":" "},{"$f":"IF('VAV-uitgebreid'!AE43=0,\"\",'VAV-uitgebreid'!AE43)","v":""},{"$f":"'VAV-uitgebreid'!BD43","v":" "},{"$f":"'VAV-uitgebreid'!AF43","v":" "}]
[null,null,"Bedrag",null,"Van",null,"Tot",null,{"$f":"IFERROR(YEAR('VAV-uitgebreid'!B44),\"\")","v":""},{"$f":"'VAV-uitgebreid'!G44","v":" "},{"$f":"IF(I18=\"\",\"\",IF($C$29=\"ja\",'VAV-uitgebreid'!M44,1))","v":""},{"$f":"IF(I18=\"\", \"\",'VAV-uitgebreid'!Q44)","v":""},{"$f":"IF(I18=\"\", \"\",'VAV-uitgebreid'!N44)","v":""},{"$f":"IF($C$29=\"ja\",'VAV-uitgebreid'!AA44,'VAV-uitgebreid'!AB44)","v":" "},{"$f":"IF('VAV-uitgebreid'!AD44=0,\"\", 'VAV-uitgebreid'!AD44)","v":""},{"$f":"'VAV-uitgebreid'!AG44","v":" "},{"$f":"IF('VAV-uitgebreid'!AE44=0,\"\",'VAV-uitgebreid'!AE44)","v":""},{"$f":"'VAV-uitgebreid'!BD44","v":" "},{"$f":"'VAV-uitgebreid'!AF44","v":" "}]
[null,null,{"$f":"'CW-berekening'!D12","v":0},null,{"$f":"DATE('CW-berekening'!D9,1,1)","v":"1900-01-01"},null,{"$f":"DATE(('CW-berekening'!D9)+('CW-berekening'!D13),1,1)","v":"1900-01-01"},null,{"$f":"IFERROR(YEAR('VAV-uitgebreid'!B45),\"\")","v":""},{"$f":"'VAV-uitgebreid'!G45","v":" "},{"$f":"IF(I19=\"\",\"\",IF($C$29=\"ja\",'VAV-uitgebreid'!M45,1))","v":""},{"$f":"IF(I19=\"\", \"\",'VAV-uitgebreid'!Q45)","v":""},{"$f":"IF(I19=\"\", \"\",'VAV-uitgebreid'!N45)","v":""},{"$f":"IF($C$29=\"ja\",'VAV-uitgebreid'!AA45,'VAV-uitgebreid'!AB45)","v":" "},{"$f":"IF('VAV-uitgebreid'!AD45=0,\"\", 'VAV-uitgebreid'!AD45)","v":""},{"$f":"'VAV-uitgebreid'!AG45","v":" "},{"$f":"IF('VAV-uitgebreid'!AE45=0,\"\",'VAV-uitgebreid'!AE45)","v":""},{"$f":"'VAV-uitgebreid'!BD45","v":" "},{"$f":"'VAV-uitgebreid'!AF45","v":" "}]
[null,null,null,null,null,null,null,null,{"$f":"IFERROR(YEAR('VAV-uitgebreid'!B46),\"\")","v":""},{"$f":"'VAV-uitgebreid'!G46","v":" "},{"$f":"IF(I20=\"\",\"\",IF($C$29=\"ja\",'VAV-uitgebreid'!M46,1))","v":""},{"$f":"IF(I20=\"\", \"\",'VAV-uitgebreid'!Q46)","v":""},{"$f":"IF(I20=\"\", \"\",'VAV-uitgebreid'!N46)","v":""},{"$f":"IF($C$29=\"ja\",'VAV-uitgebreid'!AA46,'VAV-uitgebreid'!AB46)","v":" "},{"$f":"IF('VAV-uitgebreid'!AD46=0,\"\", 'VAV-uitgebreid'!AD46)","v":""},{"$f":"'VAV-uitgebreid'!AG46","v":" "},{"$f":"IF('VAV-uitgebreid'!AE46=0,\"\",'VAV-uitgebreid'!AE46)","v":""},{"$f":"'VAV-uitgebreid'!BD46","v":" "},{"$f":"'VAV-uitgebreid'!AF46","v":" "}]
{"$rows_left_out":78}
{"sheet":"VAV-uitgebreid","index":2,"n_rows":123,"n_cols":63,"rows_kept":123,"cut":false,"hidden":true,"merged":[[1,1,1,4],[9,30,11,30]]}
[]
[null,"VAV"]
[]
[null,"verschenen",null,{"$f":"V123","v":0}]
[null,"toekomstig",null,{"$f":"AA123-D4","v":0}]
[null,"totaal",null,{"$f":"SUM(D4:D5)","v":0}]
[]
[null,null,null,null,null,null,null,null,null,null,null,null,null,null,null,null,null,null,null,null,null,null,null,null,null,null,null,null,null,null,"Tabel berekening rendement op vermogen over 2017"]
[]
[null,"Geslacht",null,null,{"$f":"IF('CW-berekening'!D7=\"man\",\"m\",\"v\")","v":"v"},null,"v/m",null,null,{"$f":"DATE(H11,1,1)","v":"1900-01-01"},null,null,null,null,null,null,null,null,null,null,null,null,null,null,null,null,null,null,null,null,"Schijf","Uw (deel van de) grondslag","Percentage","Percentage","Percentage"]
[null,"Geboortedatum",null,null,{"$f":"'CW-berekening'!D6","v":"00:00:00"},null,null,{"$f":"YEAR(E11)","v":1900},null,{"$f":"DATE(H11,7,1)","v":"1900-07-01"},null,null,null,null,null,null,null,null,null,null,null,null,null,null,null,null,null,null,null,null,null,"sparen en beleggen",1.6299999999999999E-2,5.3900000000000003E-2,"gemiddeld"]
[null,null,null,null,null,null,null,null,null,null,{"$f":"YEAR(G13)","v":1900},null,null,null,null,null,null,null,null,null,null,null,null,null,null,null,null,null,null,null,null,null,null,null,"rendement"]
[null,"Verlies ArbeidsVermogen (jaar)",null,null,{"$f":"'CW-berekening'!D12","v":0},null,{"$f":"E15","v":"1900-01-01"},{"$f":"DATE(YEAR(G13)+'CW-berekening'!D13,MONTH(G13),DAY(G13))","v":"1900-01-01"},{"$f":"(H13-G13)/365.25-1","v":-1},null,{"$f":"K12+'CW-berekening'!D13","v":1900},null,null,null,null,null,null,null,null,null,null,null,null,null,null,null,null,null,null,null,1,"Tot en met € 75.000",0.67,0.33,2.8709999999999999E-2]
[null,null,null,null,null,null,null,null,null,null,null,null,null,null,null,null,null,null,null,null,null,null,null,null,null,null,null,null,null,null,3,"Vanaf € 975.001",0,1,5.3900000000000003E-2]
[null,"Startdatum",null,null,{"$f":"DATE('CW-berekening'!D9,1,1)","v":"1900-01-01"}]
[null,"Kapitalisatiedatum",null,null,{"$f":"DATE('CW-berekening'!D10,1,1)","v":"1900-01-01"}]
[null,"Leeftijd kap.dat.",null,null,{"$f":"IF(AND(E11>J10,E11<=J11),(DATEDIF($E$11,E16,\"y\"))+1,DATEDIF($E$11,E16,\"y\"))","v":0}]
[null,"Overlevingskans kap.dat.vrouw",null,null,{"$f":"VLOOKUP(E17,'Sterftetabel Vrouw'!$A$4:$C$124,3)","v":10000000}]
[null,"Overlevingskans kap.dat. man",null,null,{"$f":"VLOOKUP(E17,'Sterftetabel Man'!$A$4:$C$124,3)","v":10000000}]
[null,"Rendement 1",null,null,{"$f":"'CW-berekening'!D16","v":0},null,{"$f":"DATE(YEAR(E16)+'CW-berekening'!E16,MONTH(G13),DAY(G13))","v":"1900-01-01"},null,null,null,1.2999999999999999E-3,0.67,{"$f":"+K20*L20","v":8.7100000000000003E-4},null,null,null,null,null,null,null,null,null,null,null,null,null,null,null,null,null,null,null,null,null,"waarom geen box III voor kapitalisatiedatum?"]
{"$rows_left_out":104}
{"sheet":"Sterftetabel Man","index":3,"n_rows":124,"n_cols":8,"rows_kept":124,"cut":false,"hidden":true,"merged":[]}
["Sterftequotienten Gehele Bevolking 2012-2017"]
["leeftijd","MAN","afgerond"]
["lft","qx","lx"]
[0,3.8287E-3,10000000]
[1,2.431E-4,{"$f":"+C4*(1-B4)","v":9961713},null,null,{"$f":"+C4-C5","v":38287}]
[2,1.5569999999999999E-4,9959291.3075696994,null,null,2421.6924303006381]
[3,1.338E-4,9957740.645913111,null,null,1550.661656588316]
[4,1.082E-4,9956408.3002146874,null,null,1332.3456984236836]
[5,9.0199999999999997E-5,9955331.0168366041,null,null,1077.2833780832589]
[6,7.8899999999999993E-5,9954433.0459788851,null,null,897.97085771895945]
[7,7.5500000000000006E-5,9953647.6412115581,null,null,785.40476732701063]
[8,7.36E-5,9952896.1408146471,null,null,751.50039691105485]
[9,7.36E-5,9952163.6076586824,null,null,732.53315596468747]
[10,7.9400000000000006E-5,9951431.1284171585,null,null,732.47924152389169]
[11,8.3499999999999997E-5,9950640.9847855624,null,null,790.14363159611821]
[12,9.3200000000000002E-5,9949810.1062633321,null,null,830.87852223031223]
[13,1.0280000000000001E-4,9948882.7839614283,null,null,927.32230190373957]
[14,1.2909999999999999E-4,9947860.0388112366,null,null,1022.7451501917094]
[15,1.6009999999999999E-4,9946575.7700802255,null,null,1284.2687310110778]
[16,1.9450000000000001E-4,9944983.3232994359,null,null,1592.4467807896435]
{"$rows_left_out":105}
{"sheet":"Sterftetabel Vrouw","index":4,"n_rows":124,"n_cols":3,"rows_kept":124,"cut":false,"hidden":true,"merged":[]}
["Sterftequotienten Gehele Bevolking 2012-2017"]
["leeftijd","VROUW","afgerond"]
["lft","qy","ly"]
[0,3.2599999999999999E-3,10000000]
[1,2.1330000000000001E-4,{"$f":"+C4*(1-B4)","v":9967400}]
[2,9.6600000000000003E-5,{"$f":"+C5*(1-B5)","v":9965273.9535799995}]
[3,8.9900000000000003E-5,9964311.308116084]
[4,7.3499999999999998E-5,9963415.5165294837]
[5,7.1299999999999998E-5,9962683.2054890189]
[6,6.8999999999999997E-5,9961972.8661764674]
[7,7.2299999999999996E-5,9961285.4900487009]
[8,7.3100000000000001E-5,9960565.2891077697]
[9,7.6199999999999995E-5,9959837.1717851348]
[10,7.8700000000000002E-5,9959078.2321926448]
[11,7.8399999999999995E-5,9958294.4527357705]
[12,8.1899999999999999E-5,9957513.7224506754]
[13,8.9400000000000005E-5,9956698.2020768076]
[14,1.014E-4,9955808.0732575413]
[15,1.12E-4,9954798.5543189123]
[16,1.3420000000000001E-4,9953683.6168808285]
{"$rows_left_out":105}
{"sheet":"Blad2","index":5,"n_rows":31,"n_cols":7,"rows_kept":31,"cut":false,"hidden":true,"merged":[]}
[]
[null,"Aanpassingen"]
[]
["-","Rendement en inflatie begint te lopen op 1-1 van kapitalisatiejaar of op 1-7 van kapitalisatiejaar (HRP per 1-1 en bij NRL op 1-7)"]
["-","Leeftijd tbv berekenen sterftecijfers?  Jaar-/-geboortejaar, of differentieren op specifieke geboortedatum? "]
[]
[]
[]
[]
[]
[]
[]
[]
[]
[]
[]
[]
[]
[]
[]
{"$rows_left_out":12}
{"sheet":"Blad3","index":6,"n_rows":75,"n_cols":10,"rows_kept":75,"cut":false,"hidden":true,"merged":[]}
[null,1993]
[null,1994]
[null,1995]
[null,1996,null,"man",null,null,null,"ja"]
[null,1997,null,"vrouw",null,null,null,"nee"]
[null,1998,null,null,null,1,null,null,null,"nee"]
[null,1999,null,null,null,2,null,null,null,"Ja, enkele vrijstelling (€30.360)"]
[null,2000,null,null,null,3,null,null,null,"Ja, dubbele vrijstelling (€60.720)"]
[null,2001,null,null,null,4]
[null,2002,null,null,null,5]
[null,2003,null,null,null,6]
[null,2004,null,null,null,7]
[null,2005,null,null,null,8]
[null,2006,null,null,null,9,null,null,null,"Gedurende hoeveel jaar?"]
[null,2007,null,null,null,10,null,null,null,1]
[null,2008,null,null,null,11,null,null,null,2]
[null,2009,null,null,null,12,null,null,null,3]
[null,2010,null,null,null,13,null,null,null,4]
[null,2011,null,null,null,14,null,null,null,5]
[null,2012,null,null,null,15,null,null,null,6]
{"$rows_left_out":56}
{"sheet":"Blad1","index":7,"n_rows":0,"n_cols":0,"rows_kept":0,"cut":false,"hidden":true,"merged":[]}

{"sheet":"Blad4","index":8,"n_rows":0,"n_cols":0,"rows_kept":0,"cut":false,"hidden":true,"merged":[]}